Reaction Details
TargetMembrane primary amine oxidase
LigandBDBM128988
Substrate/Competitorn/a
Meas. Tech.Inhibition Assay
Temperature298.15±n/a K
IC50 6.9±n/a nM
Commentsextracted
Citation Yoshihara, KSuzuki, DYamaki, SKoga, YSeki, NFujiyasu, JNeya, M Glycine compound US Patent US8802679 Publication Date 8/12/2014
 
Membrane primary amine oxidase
Name:Membrane primary amine oxidase
Type:Protein
Mol. Mass.:84620.86
Organism:Homo sapiens (Human)
Description:Q16853
Residue:763
BDBM128988
NameBDBM128988
Synonyms:US8802679, 19
TypeSmall organic molecule
Emp. Form.C27H31N7O3
Mol. Mass.501.5801
SMILESCN(Cc1cccc(c1)-c1cnc(nc1)N1CCN(CC1)c1ncc(\C=C\C(O)=O)cc1C)C(=O)CN