Reaction Details
TargetSphingosine 1-phosphate receptor 1
LigandBDBM129589
Substrate/Competitorn/a
Meas. Tech.Receptor Binding Assay
pH7.4±n/a
Temperature277.15±n/a K
Ki 2±n/a nM
Commentsextracted
Citation Quattropani, ABaker-Glenn, CBlackaby, WKnight, C Pyrazole oxadiazole derivatives as S1P1 agonists US Patent US8802663 Publication Date 8/12/2014
 
Sphingosine 1-phosphate receptor 1
Name:Sphingosine 1-phosphate receptor 1
Type:Enzyme
Mol. Mass.:42836.02
Organism:Homo sapiens (Human)
Description:P21453
Residue:382
BDBM129589
NameBDBM129589
Synonyms:US8802663, 117
TypeSmall organic molecule
Emp. Form.C22H26N4O3
Mol. Mass.394.4668
SMILESOCc1ccc(cc1)-c1noc(n1)-c1cnn(C2CCCCC2)c1C1CCCO1