Reaction Details
TargetMuscarinic acetylcholine receptor M3
LigandBDBM103817
Substrate/Competitorn/a
Meas. Tech.Radioligand Binding Assay
Ki 0.1±n/a nM
Citation Hughes, ADChen, YJacobsen, JRStangeland, ELYen, R Diamide compounds having muscarinic receptor antagonist and β2 adrenergic receptor agonist activity US Patent US8816088 Publication Date 8/26/2014
 
Muscarinic acetylcholine receptor M3
Name:Muscarinic acetylcholine receptor M3
Type:Enzyme
Mol. Mass.:66151.03
Organism:Homo sapiens (Human)
Description:P20309
Residue:590
BDBM103817
NameBDBM103817
Synonyms:US8551978, I-88 US9394275, I-88 US9682957, I-88
TypeSmall organic molecule
Emp. Form.C52H58N6O7
Mol. Mass.879.0529
SMILESCC(Cc1ccc(CCNC(=O)Cc2ccc(cc2)N(C)C(=O)CCN2CCC(CC2)OC(=O)Nc2ccccc2-c2ccccc2)cc1)NC[C@H](O)c1ccc(O)c2[nH]c(=O)ccc12