Reaction Details
TargetEstrogen receptor
LigandBDBM129626
Substrate/Competitorn/a
Meas. Tech.Binding Assay
Temperature277.15±n/a K
IC50 30±n/a nM
Commentsextracted
Citation Pickar, JHKomm, BS 2-Phenyl-1-[4-(2-Aminoethoxy)-Benzyl]-Indole and estrogen formulations US Patent US8815934 Publication Date 8/26/2014
 
Estrogen receptor
Name:Estrogen receptor
Type:Protein
Mol. Mass.:66230.44
Organism:Homo sapiens (Human)
Description:P03372
Residue:595
BDBM129626
NameBDBM129626
Synonyms:US8815934, No. 99
TypeSmall organic molecule
Emp. Form.C31H36N2O3
Mol. Mass.484.6291
SMILESCc1c(-c2ccc(O)cc2)n(Cc2ccc(OCCN3CCCCCCC3)cc2)c2ccc(O)cc12