Reaction Details
TargetEstrogen receptor
LigandBDBM129633
Substrate/Competitorn/a
Meas. Tech.Binding Assay
Temperature277.15±n/a K
IC50 37±n/a nM
Commentsextracted
Citation Pickar, JHKomm, BS 2-Phenyl-1-[4-(2-Aminoethoxy)-Benzyl]-Indole and estrogen formulations US Patent US8815934 Publication Date 8/26/2014
 
Estrogen receptor
Name:Estrogen receptor
Type:Protein
Mol. Mass.:66230.44
Organism:Homo sapiens (Human)
Description:P03372
Residue:595
BDBM129633
NameBDBM129633
Synonyms:US8815934, No. 110
TypeSmall organic molecule
Emp. Form.C30H34N2O3
Mol. Mass.470.6026
SMILESCC1CCN(CCOc2ccc(Cn3c(c(C)c4cc(O)ccc34)-c3ccc(O)cc3)cc2)CC1