Reaction Details
TargetEstrogen receptor
LigandBDBM129649
Substrate/Competitorn/a
Meas. Tech.Binding Assay
Temperature277.15±n/a K
IC50 4±n/a nM
Commentsextracted
Citation Pickar, JHKomm, BS 2-Phenyl-1-[4-(2-Aminoethoxy)-Benzyl]-Indole and estrogen formulations US Patent US8815934 Publication Date 8/26/2014
 
Estrogen receptor
Name:Estrogen receptor
Type:Protein
Mol. Mass.:66230.44
Organism:Homo sapiens (Human)
Description:P03372
Residue:595
BDBM129649
NameBDBM129649
Synonyms:US8815934, No. 133
TypeSmall organic molecule
Emp. Form.C27H27ClN2O3
Mol. Mass.462.968
SMILESOc1ccc(cc1)-c1c(Cl)c2cc(O)ccc2n1Cc1ccc(OCCN2CCCC2)cc1