Reaction Details
TargetEstrogen receptor
LigandBDBM129651
Substrate/Competitorn/a
Meas. Tech.Binding Assay
Temperature277.15±n/a K
IC50 29±n/a nM
Commentsextracted
Citation Pickar, JHKomm, BS 2-Phenyl-1-[4-(2-Aminoethoxy)-Benzyl]-Indole and estrogen formulations US Patent US8815934 Publication Date 8/26/2014
 
Estrogen receptor
Name:Estrogen receptor
Type:Protein
Mol. Mass.:66230.44
Organism:Homo sapiens (Human)
Description:P03372
Residue:595
BDBM129651
NameBDBM129651
Synonyms:US8815934, No. 135
TypeSmall organic molecule
Emp. Form.C29H31ClN2O3
Mol. Mass.491.021
SMILESOc1ccc(cc1)-c1c(Cl)c2cc(O)ccc2n1Cc1ccc(OCCN2CCCCCC2)cc1