Reaction Details
TargetD(3) dopamine receptor
LigandBDBM6775
Substrate/Competitorn/a
Meas. Tech.Receptor Binding Assay
Ki 2±n/a nM
Citation Szalai, GBCsongor, EADomany, GGyertyan, IKiss, BLaszy, JSaghy, KSchmidt, EFarkas, SKomlodi, Z Pyrimidinyl-piperazines useful as D3/D2 receptor ligands US Patent US8802672 Publication Date 8/12/2014
 
D(3) dopamine receptor
Name:D(3) dopamine receptor
Type:Protein
Mol. Mass.:49540.58
Organism:Rattus norvegicus (Rat)
Description:P19020
Residue:446
BDBM6775
NameBDBM6775
Synonyms:US8802672, 8
Typen/a
Emp. Form.C20H33Cl2N7O
Mol. Mass.458.428
SMILESCNc1nc(Cl)c(Cl)c(n1)N1CCN(CCC2CCC(CC2)NC(=O)N(C)C)CC1