Reaction Details
TargetD(3) dopamine receptor
LigandBDBM129720
Substrate/Competitorn/a
Meas. Tech.Receptor Binding Assay
Ki<1±n/a nM
Citation Szalai, GBCsongor, EADomany, GGyertyan, IKiss, BLaszy, JSaghy, KSchmidt, EFarkas, SKomlodi, Z Pyrimidinyl-piperazines useful as D3/D2 receptor ligands US Patent US8802672 Publication Date 8/12/2014
 
D(3) dopamine receptor
Name:D(3) dopamine receptor
Type:Protein
Mol. Mass.:49540.58
Organism:Rattus norvegicus (Rat)
Description:P19020
Residue:446
BDBM129720
NameBDBM129720
Synonyms:US8802672, 10
TypeSmall organic molecule
Emp. Form.C20H33Cl2N7O
Mol. Mass.458.428
SMILESCCNC(=O)NC1CCC(CCN2CCN(CC2)c2nc(NC)nc(Cl)c2Cl)CC1