Reaction Details
TargetD(2) dopamine receptor
LigandBDBM35254
Substrate/Competitorn/a
Meas. Tech.Receptor Binding Assay
Ki 96±n/a nM
Citation Szalai, GBCsongor, EADomany, GGyertyan, IKiss, BLaszy, JSaghy, KSchmidt, EFarkas, SKomlodi, Z Pyrimidinyl-piperazines useful as D3/D2 receptor ligands US Patent US8802672 Publication Date 8/12/2014
 
D(2) dopamine receptor
Name:D(2) dopamine receptor
Type:G Protein-Coupled Receptor (GPCR)
Mol. Mass.:50931.60
Organism:Rattus norvegicus (rat)
Description:P61169
Residue:444
BDBM35254
NameBDBM35254
Synonyms:2-methyl-4-(4-methylpiperazin-1-yl)-10H-thieno[2,3-b][1,5]benzodiazepine Olansek Zyprexa | olanzapine
TypeSmall organic molecule
Emp. Form.C17H20N4S
Mol. Mass.312.432
SMILESCN1CCN(CC1)C1=Nc2ccccc2Nc2sc(C)cc12