Reaction Details
TargetSphingosine 1-phosphate receptor 1
LigandBDBM130390
Substrate/Competitorn/a
Meas. Tech.Binding Assay
pH7.5±n/a
Temperature298.15±n/a K
IC50 0.31±n/a nM
Commentsextracted
Citation Das, JKoo, SSSrivastava, ASMoquin, RVWatterson, SH Substituted 3-phenyl-1,2,4-Oxadiazole compounds US Patent US8822510 Publication Date 9/2/2014
 
Sphingosine 1-phosphate receptor 1
Name:Sphingosine 1-phosphate receptor 1
Type:Enzyme
Mol. Mass.:42836.02
Organism:Homo sapiens (Human)
Description:P21453
Residue:382
BDBM130390
NameBDBM130390
Synonyms:US8822510, 18
TypeSmall organic molecule
Emp. Form.C27H30FN3O4
Mol. Mass.479.5432
SMILESOC(=O)C1CN(Cc2ccc(cc2)-c2noc(COCC3(CCCCC3)c3ccc(F)cc3)n2)C1