Reaction Details
TargetHigh affinity cGMP-specific 3',5'-cyclic phosphodiesterase 9A
LigandBDBM130499
Substrate/Competitorn/a
Meas. Tech.Inhibition Assay
pH7.5±n/a
IC50 12±n/a nM
Commentsextracted
Citation Hendrix, MBärfacker, LErb, CHafner, FHeckroth, HKarthaus, DTersteegen, Avan der Staay, Fvan Kampen, M 6-cyclylmethyl-and 6-alkylmethyl-substituted pyrazolepyrimidines US Patent US8822479 Publication Date 9/2/2014
 
High affinity cGMP-specific 3',5'-cyclic phosphodiesterase 9A
Name:High affinity cGMP-specific 3',5'-cyclic phosphodiesterase 9A
Type:Protein
Mol. Mass.:68488.40
Organism:Homo sapiens (Human)
Description:O76083
Residue:593
BDBM130499
NameBDBM130499
Synonyms:US8822479, 5
TypeSmall organic molecule
Emp. Form.C17H16Cl2N4O
Mol. Mass.363.241
SMILESClc1ccc(Cl)c(c1)-n1ncc2c1nc(CC1CCCC1)[nH]c2=O