Reaction Details
TargetKetohexokinase
LigandBDBM130666
Substrate/Competitorn/a
Meas. Tech.Enzyme Assay
Temperature298.15±n/a K
IC50>10000±n/a nM
Commentsextracted
Citation Zhang, XAbad, MCGibbs, ACKuo, GKuo, LCSong, FSui, Z Indazole compounds useful as ketohexokinase inhibitors US Patent US8822447 Publication Date 9/2/2014
 
Ketohexokinase
Name:Ketohexokinase
Type:Enzyme Catalytic Domain
Mol. Mass.:32521.64
Organism:Homo sapiens (Human)
Description:n/a
Residue:298
BDBM130666
NameBDBM130666
Synonyms:US8822447, 180 | US9771375, Example 180
TypeSmall organic molecule
Emp. Form.C20H21N3S
Mol. Mass.335.466
SMILESCSc1nn(-c2ccccc2C)c2cc(ccc12)C1=CCNCC1