Reaction Details
TargetFibroblast growth factor receptor 1
LigandBDBM130811
Substrate/Competitorn/a
Meas. Tech.Enzyme Inhibition Assay
IC50 0.81±n/a nM
Citation Taka, NOhmori, MTakami, KMatsushita, MHayase, THyodo, IKochi, MNishii, HEbiike, HNakanishi, YMio, TWang, LZhao, W Aminopyrazole derivative US Patent US8829199 Publication Date 9/9/2014
 
Fibroblast growth factor receptor 1
Name:Fibroblast growth factor receptor 1
Type:Receptor
Mol. Mass.:91861.70
Organism:Homo sapiens (Human)
Description:P11362
Residue:822
BDBM130811
NameBDBM130811
Synonyms:US8829199, 40
TypeSmall organic molecule
Emp. Form.C25H23N6O3
Mol. Mass.455.4885
SMILESCc1nc2ccc(cc2n1)-n1ncc(C(=O)c2cc3ccc(OCC4(C)COC4)cc3[nH]2)c1N