Reaction Details
TargetcAMP-specific 3',5'-cyclic phosphodiesterase 4A
LigandBDBM130928
Substrate/Competitorn/a
Meas. Tech.Binding Assay
IC50 4±n/a nM
Citation Felding, JSørensen, MD Triazolopyridines as phosphodiesterase inhibitors for treatment of dermal diseases US Patent US8829190 Publication Date 9/9/2014
 
cAMP-specific 3',5'-cyclic phosphodiesterase 4A
Name:cAMP-specific 3',5'-cyclic phosphodiesterase 4A
Type:Enzyme
Mol. Mass.:98113.27
Organism:Homo sapiens (Human)
Description:P27815
Residue:886
BDBM130928
NameBDBM130928
Synonyms:US8829190, 106
TypeSmall organic molecule
Emp. Form.C18H16Cl2N4O3
Mol. Mass.407.251
SMILESCOc1ccc(C(=O)Cc2c(Cl)cncc2Cl)n2nc(nc12)C1(CO)CC1