Reaction Details
Target5-hydroxytryptamine receptor 2A
LigandBDBM50352717
Substrate/Competitorn/a
Meas. Tech.Binding Assay
pH7.4±n/a
IC50 72.5±n/a nM
Commentsextracted
Citation Lee, JSeo, HJKang, SYPark, EKim, MJLee, SHKim, JYKim, JJung, MEKim, HJKim, MHan, HKAhn, KWLee, MWLee, KPae, ANPark, W Arylpiperazine-containing imidazole 4-carboxamide derivatives and pharmaceutical composition comprising same US Patent US8835436 Publication Date 9/16/2014
 
5-hydroxytryptamine receptor 2A
Name:5-hydroxytryptamine receptor 2A
Type:undefined
Mol. Mass.:52607.65
Organism:Homo sapiens (Human)
Description:P28223
Residue:471
BDBM50352717
NameBDBM50352717
Synonyms:CHEMBL1823213 | US8835436, Example 151
TypeSmall organic molecule
Emp. Form.C27H35N5O2
Mol. Mass.461.5991
SMILESCc1nc(C(=O)NC[C@@H](O)CN2CCN(CC2)c2cccc(C)c2C)c(C)n1-c1ccccc1