Reaction Details
TargetGamma-aminobutyric acid receptor subunit alpha-5
LigandBDBM133595
Substrate/Competitorn/a
Meas. Tech.Radioligand Binding Assay
pH7.5±n/a
Temperature277.15±n/a K
Ki 0.6±n/a nM
Commentsextracted
Citation Buettelmann, BJakob-Roetne, RKnust, HLucas, MCThomas, A Isoxazolo-pyridine derivatives US Patent US8846719 Publication Date 9/30/2014
 
Gamma-aminobutyric acid receptor subunit alpha-5
Name:Gamma-aminobutyric acid receptor subunit alpha-5
Type:Enzyme
Mol. Mass.:52160.59
Organism:Homo sapiens (Human)
Description:P31644
Residue:462
BDBM133595
NameBDBM133595
Synonyms:US8846719, 298
TypeSmall organic molecule
Emp. Form.C17H15FN4O3
Mol. Mass.342.3244
SMILESCc1onc(c1COCc1ccc(cn1)C(N)=O)-c1ccc(F)cn1