Reaction Details
TargetGamma-aminobutyric acid receptor subunit alpha-5
LigandBDBM133501
Substrate/Competitorn/a
Meas. Tech.Radioligand Binding Assay
pH7.5±n/a
Temperature277.15±n/a K
Ki 1±n/a nM
Commentsextracted
Citation Buettelmann, BJakob-Roetne, RKnust, HLucas, MCThomas, A Isoxazolo-pyridine derivatives US Patent US8846719 Publication Date 9/30/2014
 
Gamma-aminobutyric acid receptor subunit alpha-5
Name:Gamma-aminobutyric acid receptor subunit alpha-5
Type:Enzyme
Mol. Mass.:52160.59
Organism:Homo sapiens (Human)
Description:P31644
Residue:462
BDBM133501
NameBDBM133501
Synonyms:US8846719, 190
TypeSmall organic molecule
Emp. Form.C20H21N3O4
Mol. Mass.367.3984
SMILESCC(CO)NC(=O)c1ccc(OCc2c(C)onc2-c2ccccc2)nc1