Reaction Details
TargetCannabinoid receptor 2
LigandBDBM143572
Substrate/Competitorn/a
Meas. Tech.cAMP Assay
Temperature300.15±n/a K
EC50 4459±n/a nM
Commentsextracted
Citation Macielag, MJZhang, YDeCorte, BLGreco, MN Quinazoline derivatives useful as CB-1 inverse agonists US Patent US9682955 Publication Date 6/20/2017
 
Cannabinoid receptor 2
Name:Cannabinoid receptor 2
Type:G Protein-Coupled Receptor (GPCR)
Mol. Mass.:39690.94
Organism:Homo sapiens (Human)
Description:P34972
Residue:360
BDBM143572
NameBDBM143572
Synonyms:US9682955, 54
TypeSmall organic molecule
Emp. Form.C34H30Cl2F3N3O4
Mol. Mass.672.521
SMILESOCC(CO)(CO)COc1nc(NCc2cccc(c2)C(F)(F)F)c2cc(ccc2n1)C(c1ccc(Cl)cc1)c1ccc(Cl)cc1