Reaction Details
TargetCannabinoid receptor 1
LigandBDBM143564
Substrate/Competitorn/a
Meas. Tech.cAMP Assay
Temperature300.15±n/a K
EC50 13±n/a nM
Commentsextracted
Citation Macielag, MJZhang, YDeCorte, BLGreco, MN Quinazoline derivatives useful as CB-1 inverse agonists US Patent US9682955 Publication Date 6/20/2017
 
Cannabinoid receptor 1
Name:Cannabinoid receptor 1
Type:G Protein-Coupled Receptor (GPCR)
Mol. Mass.:52868.96
Organism:Homo sapiens (Human)
Description:P21554
Residue:472
BDBM143564
NameBDBM143564
Synonyms:US9682955, 55
TypeSmall organic molecule
Emp. Form.C31H24Cl2F3N3O2
Mol. Mass.598.442
SMILESOCCOc1nc(NCc2cccc(c2)C(F)(F)F)c2cc(ccc2n1)C(c1ccc(Cl)cc1)c1ccc(Cl)cc1