Reaction Details
TargetCannabinoid receptor 2
LigandBDBM143562
Substrate/Competitorn/a
Meas. Tech.cAMP Assay
Temperature300.15±n/a K
EC50>10000±n/a nM
Commentsextracted
Citation Macielag, MJZhang, YDeCorte, BLGreco, MN Quinazoline derivatives useful as CB-1 inverse agonists US Patent US9682955 Publication Date 6/20/2017
 
Cannabinoid receptor 2
Name:Cannabinoid receptor 2
Type:G Protein-Coupled Receptor (GPCR)
Mol. Mass.:39690.94
Organism:Homo sapiens (Human)
Description:P34972
Residue:360
BDBM143562
NameBDBM143562
Synonyms:US9682955, 59
TypeSmall organic molecule
Emp. Form.C29H21Cl2N3O2
Mol. Mass.514.402
SMILESOC(=O)c1cccc(CNc2ncnc3ccc(cc23)C(c2ccc(Cl)cc2)c2ccc(Cl)cc2)c1