Reaction Details
TargetCannabinoid receptor 1
LigandBDBM143589
Substrate/Competitorn/a
Meas. Tech.cAMP Assay
Temperature300.15±n/a K
EC50 15±n/a nM
Commentsextracted
Citation Macielag, MJZhang, YDeCorte, BLGreco, MN Quinazoline derivatives useful as CB-1 inverse agonists US Patent US9682955 Publication Date 6/20/2017
 
Cannabinoid receptor 1
Name:Cannabinoid receptor 1
Type:G Protein-Coupled Receptor (GPCR)
Mol. Mass.:52868.96
Organism:Homo sapiens (Human)
Description:P21554
Residue:472
BDBM143589
NameBDBM143589
Synonyms:US9682955, 64
TypeSmall organic molecule
Emp. Form.C38H36Cl2N4O7S
Mol. Mass.763.686
SMILESCC(C)OC(=O)OCOC(=O)c1ccc(cc1)S(=O)(=O)N1CCC(CC1)Nc1ncnc2ccc(cc12)C(c1ccc(Cl)cc1)c1ccc(Cl)cc1