Reaction Details
TargetCannabinoid receptor 2
LigandBDBM143527
Substrate/Competitorn/a
Meas. Tech.cAMP Assay
Temperature300.15±n/a K
EC50>10000±n/a nM
Commentsextracted
Citation Macielag, MJZhang, YDeCorte, BLGreco, MN Quinazoline derivatives useful as CB-1 inverse agonists US Patent US9682955 Publication Date 6/20/2017
 
Cannabinoid receptor 2
Name:Cannabinoid receptor 2
Type:G Protein-Coupled Receptor (GPCR)
Mol. Mass.:39690.94
Organism:Homo sapiens (Human)
Description:P34972
Residue:360
BDBM143527
NameBDBM143527
Synonyms:US9682955, 71
TypeSmall organic molecule
Emp. Form.C33H28Cl2F3N3O2
Mol. Mass.626.496
SMILESOCCCCOc1nc(NCc2ccc(cc2)C(F)(F)F)c2cc(ccc2n1)C(c1ccc(Cl)cc1)c1ccc(Cl)cc1