Reaction Details
TargetIsoform 4 of cAMP-specific 3',5'-cyclic phosphodiesterase 4A (RD1)
LigandBDBM285530
Substrate/Competitorn/a
Meas. Tech.The PDE4A3, PDE4B1, PDE4C1 and PDE4D3 assays
IC50 12.7±n/a nM
Citation Chappie, TAPatel, NCHayward, MMHelal, CJSciabola, SLaChapelle, EAYoung, JMVerhoest, PR Imidazopyridazine compounds US Patent US10077269 Publication Date 9/18/2018
 
Isoform 4 of cAMP-specific 3',5'-cyclic phosphodiesterase 4A (RD1)
Name:Isoform 4 of cAMP-specific 3',5'-cyclic phosphodiesterase 4A (RD1)
Type:Enzyme Catalytic Domain
Mol. Mass.:72186.86
Organism:Homo sapiens (Human)
Description:P27815-4
Residue:647
BDBM285530
NameBDBM285530
Synonyms:Azetidin-1-yl[3-(3,5-difluoro-4-methoxyphenyl)imidazo[1,2-b]pyridazin-2-yl]methanone (3) US10669279, Example 3 | US9598421, Example 3
TypeSmall organic molecule
Emp. Form.C17H14F2N4O2
Mol. Mass.344.3155
SMILESCOc1c(F)cc(cc1F)-c1c(nc2cccnn12)C(=O)N1CCC1