Reaction Details
TargetcAMP-specific 3',5'-cyclic phosphodiesterase 4B [122-736,S654A]
LigandBDBM285546
Substrate/Competitorn/a
Meas. Tech.The PDE4A3, PDE4B1, PDE4C1 and PDE4D3 assays
IC50 13.6±n/a nM
Citation Chappie, TAPatel, NCHayward, MMHelal, CJSciabola, SLaChapelle, EAYoung, JMVerhoest, PR Imidazopyridazine compounds US Patent US10077269 Publication Date 9/18/2018
 
cAMP-specific 3',5'-cyclic phosphodiesterase 4B [122-736,S654A]
Name:cAMP-specific 3',5'-cyclic phosphodiesterase 4B [122-736,S654A]
Type:Enzyme Catalytic Domain
Mol. Mass.:70253.85
Organism:Homo sapiens (Human)
Description:Q07343[122-736,S654A]
Residue:615
BDBM285546
NameBDBM285546
Synonyms:3-(4-cyano-5-fluoro-2-methylphenyl)-N-cyclo-propylimidazo[1,2-b]pyridazine-2-carboxamide US10669279, Example 19 | US9598421, Example 19
TypeSmall organic molecule
Emp. Form.C18H14FN5O
Mol. Mass.335.3351
SMILESCc1cc(C#N)c(F)cc1-c1c(nc2cccnn12)C(=O)NC1CC1