Reaction Details
TargetcAMP-specific 3',5'-cyclic phosphodiesterase 4B [122-736,S654A]
LigandBDBM285598
Substrate/Competitorn/a
Meas. Tech.The PDE4A3, PDE4B1, PDE4C1 and PDE4D3 assays
IC50 2.82±n/a nM
Citation Chappie, TAPatel, NCHayward, MMHelal, CJSciabola, SLaChapelle, EAYoung, JMVerhoest, PR Imidazopyridazine compounds US Patent US10077269 Publication Date 9/18/2018
 
cAMP-specific 3',5'-cyclic phosphodiesterase 4B [122-736,S654A]
Name:cAMP-specific 3',5'-cyclic phosphodiesterase 4B [122-736,S654A]
Type:Enzyme Catalytic Domain
Mol. Mass.:70253.85
Organism:Homo sapiens (Human)
Description:Q07343[122-736,S654A]
Residue:615
BDBM285598
NameBDBM285598
Synonyms:3-(3-chloro-4-methylphenyl)-N-[(1R,2S)-2-fluorocyclopro-pyl]imidazo[1,2-b]pyridazine-2-carboxamide US10669279, Example 71 | US9598421, Example 71
TypeSmall organic molecule
Emp. Form.C17H14ClFN4O
Mol. Mass.344.771
SMILESCc1ccc(cc1Cl)-c1c(nc2cccnn12)C(=O)N[C@@H]1C[C@@H]1F