Reaction Details
TargetcAMP-specific 3',5'-cyclic phosphodiesterase 4B [122-736,S654A]
LigandBDBM285602
Substrate/Competitorn/a
Meas. Tech.The PDE4A3, PDE4B1, PDE4C1 and PDE4D3 assays
IC50 5.99±n/a nM
Citation Chappie, TAPatel, NCHayward, MMHelal, CJSciabola, SLaChapelle, EAYoung, JMVerhoest, PR Imidazopyridazine compounds US Patent US10077269 Publication Date 9/18/2018
 
cAMP-specific 3',5'-cyclic phosphodiesterase 4B [122-736,S654A]
Name:cAMP-specific 3',5'-cyclic phosphodiesterase 4B [122-736,S654A]
Type:Enzyme Catalytic Domain
Mol. Mass.:70253.85
Organism:Homo sapiens (Human)
Description:Q07343[122-736,S654A]
Residue:615
BDBM285602
NameBDBM285602
Synonyms:N-cyclopropyl-3-[2-(difluoro-methoxy)pyridin-4-yl]imidazo[1,2-b]pyridazine-2-carboxamide US10669279, Example 75 | US9598421, Example 75
TypeSmall organic molecule
Emp. Form.C16H13F2N5O2
Mol. Mass.345.3035
SMILESFC(F)Oc1cc(ccn1)-c1c(nc2cccnn12)C(=O)NC1CC1