Reaction Details
TargetcAMP-specific 3',5'-cyclic phosphodiesterase 4B [122-736,S654A]
LigandBDBM285611
Substrate/Competitorn/a
Meas. Tech.The PDE4A3, PDE4B1, PDE4C1 and PDE4D3 assays
IC50 9.34±n/a nM
Citation Chappie, TAPatel, NCHayward, MMHelal, CJSciabola, SLaChapelle, EAYoung, JMVerhoest, PR Imidazopyridazine compounds US Patent US10077269 Publication Date 9/18/2018
 
cAMP-specific 3',5'-cyclic phosphodiesterase 4B [122-736,S654A]
Name:cAMP-specific 3',5'-cyclic phosphodiesterase 4B [122-736,S654A]
Type:Enzyme Catalytic Domain
Mol. Mass.:70253.85
Organism:Homo sapiens (Human)
Description:Q07343[122-736,S654A]
Residue:615
BDBM285611
NameBDBM285611
Synonyms:3-(4-chloro-3-fluorophenyl)-N-ethylimidazo[1,2-b]pyridazine-2-carboxamide US10669279, Example 81 | US9598421, Example 81
TypeSmall organic molecule
Emp. Form.C15H12ClFN4O
Mol. Mass.318.733
SMILESCCNC(=O)c1nc2cccnn2c1-c1ccc(Cl)c(F)c1