Reaction Details
TargetIsoform 3 of cAMP-specific 3',5'-cyclic phosphodiesterase 4D (hPDE4D3)
LigandBDBM285615
Substrate/Competitorn/a
Meas. Tech.The PDE4A3, PDE4B1, PDE4C1 and PDE4D3 assays
IC50 47.2±n/a nM
Citation Chappie, TAPatel, NCHayward, MMHelal, CJSciabola, SLaChapelle, EAYoung, JMVerhoest, PR Imidazopyridazine compounds US Patent US10077269 Publication Date 9/18/2018
 
Isoform 3 of cAMP-specific 3',5'-cyclic phosphodiesterase 4D (hPDE4D3)
Name:Isoform 3 of cAMP-specific 3',5'-cyclic phosphodiesterase 4D (hPDE4D3)
Type:n/a
Mol. Mass.:76431.39
Organism:Homo sapiens (Human)
Description:Q08499-2
Residue:673
BDBM285615
NameBDBM285615
Synonyms:3-(4-chlorophenyl)-N-ethylimidazo[1,2-b]pyridazine-2-carboxamide US10669279, Example 85 | US9598421, Example 85
TypeSmall organic molecule
Emp. Form.C15H13ClN4O
Mol. Mass.300.743
SMILESCCNC(=O)c1nc2cccnn2c1-c1ccc(Cl)cc1