Reaction Details
TargetIsoform 4 of cAMP-specific 3',5'-cyclic phosphodiesterase 4A (RD1)
LigandBDBM285616
Substrate/Competitorn/a
Meas. Tech.The PDE4A3, PDE4B1, PDE4C1 and PDE4D3 assays
IC50 5.83±n/a nM
Citation Chappie, TAPatel, NCHayward, MMHelal, CJSciabola, SLaChapelle, EAYoung, JMVerhoest, PR Imidazopyridazine compounds US Patent US10077269 Publication Date 9/18/2018
 
Isoform 4 of cAMP-specific 3',5'-cyclic phosphodiesterase 4A (RD1)
Name:Isoform 4 of cAMP-specific 3',5'-cyclic phosphodiesterase 4A (RD1)
Type:Enzyme Catalytic Domain
Mol. Mass.:72186.86
Organism:Homo sapiens (Human)
Description:P27815-4
Residue:647
BDBM285616
NameBDBM285616
Synonyms:US10077269, Example 86 US9598421, Example 86 | azetidin-1-yl[3-(2,2-difluoro-1,3-benzodioxol-5-yl)imidazo[1,2-b]pyridazin-2-yl]methanone
TypeSmall organic molecule
Emp. Form.C17H12F2N4O3
Mol. Mass.358.299
SMILESFC1(F)Oc2ccc(cc2O1)-c1c(nc2cccnn12)C(=O)N1CCC1