Reaction Details
TargetVascular endothelial growth factor receptor 2
LigandBDBM133711
Substrate/Competitorn/a
Meas. Tech.Tyrosine Kinase Assay
pH7.4±n/a
Temperature298.15±n/a K
IC50 250±n/a nM
Commentsextracted
Citation Ahn, YKim, JWBang, KCPark, BWKim, SYLee, KLee, KKo, MKim, HKKim, YHKim, MSLee, GS Quinazoline derivatives as a multiplex inhibitor and method for the preparation thereof US Patent US8846699 Publication Date 9/30/2014
 
Vascular endothelial growth factor receptor 2
Name:Vascular endothelial growth factor receptor 2
Type:Receptor Tyrosine Kinase
Mol. Mass.:151510.97
Organism:Homo sapiens (Human)
Description:P35968
Residue:1356
BDBM133711
NameBDBM133711
Synonyms:US8846699, 27 | US8846699, 55
TypeSmall organic molecule
Emp. Form.C22H21BrFN5O3
Mol. Mass.502.336
SMILESCC(=O)CNCCOc1cc2ncnc(Nc3ccc(Br)cc3F)c2cc1NC(=O)C=C