Reaction Details
TargetEpidermal growth factor receptor
LigandBDBM133696
Substrate/Competitorn/a
Meas. Tech.Tyrosine Kinase Assay
pH7.4±n/a
Temperature298.15±n/a K
IC50 2±n/a nM
Commentsextracted
Citation Ahn, YKim, JWBang, KCPark, BWKim, SYLee, KLee, KKo, MKim, HKKim, YHKim, MSLee, GS Quinazoline derivatives as a multiplex inhibitor and method for the preparation thereof US Patent US8846699 Publication Date 9/30/2014
 
Epidermal growth factor receptor
Name:Epidermal growth factor receptor
Type:Receptor Kinase Domain
Mol. Mass.:134279.59
Organism:Homo sapiens (Human)
Description:P00533
Residue:1210
BDBM133696
NameBDBM133696
Synonyms:US8846699, 12
TypeSmall organic molecule
Emp. Form.C24H26BrFN6O3
Mol. Mass.545.404
SMILESCN(C)CC(=O)NCCCOc1cc2ncnc(Nc3ccc(Br)cc3F)c2cc1NC(=O)C=C