Reaction Details
TargetOpioid growth factor receptor-like protein 1
LigandBDBM13043
Substrate/Competitorn/a
Meas. Tech.Radioligand Binding Assay
pH7.4±n/a
Ki 4.4±n/a nM
Commentsextracted
Citation Fuchino, KGoehring, RRShao, BTaoda, YTsuno, NWhitehead, JWYao, J Substituted-quinoxaline-type piperidine compounds and the uses thereof US Patent US8846929 Publication Date 9/30/2014
 
Opioid growth factor receptor-like protein 1
Name:Opioid growth factor receptor-like protein 1
Type:Protein
Mol. Mass.:51247.53
Organism:Homo sapiens (Human)
Description:Q5TC84
Residue:451
BDBM13043
NameBDBM13043
Synonyms:US8846929, 228
Typen/a
Emp. Form.C29H41N5O5
Mol. Mass.539.6663
SMILES[H][C@]12CC[C@]([H])(C[C@@]([H])(C1)n1c3ccccc3nc(NCCN(CC(O)=O)CC(O)=O)c1=O)N2C1CCCCCCC1