Reaction Details
TargetOpioid growth factor receptor-like protein 1
LigandBDBM15308
Substrate/Competitorn/a
Meas. Tech.Radioligand Binding Assay
pH7.4±n/a
Ki 4.1±n/a nM
Commentsextracted
Citation Fuchino, KGoehring, RRShao, BTaoda, YTsuno, NWhitehead, JWYao, J Substituted-quinoxaline-type piperidine compounds and the uses thereof US Patent US8846929 Publication Date 9/30/2014
 
Opioid growth factor receptor-like protein 1
Name:Opioid growth factor receptor-like protein 1
Type:Protein
Mol. Mass.:51247.53
Organism:Homo sapiens (Human)
Description:Q5TC84
Residue:451
BDBM15308
NameBDBM15308
Synonyms:US8846929, 266
Typen/a
Emp. Form.C28H35N3O3
Mol. Mass.461.5958
SMILES[H][C@]12CC[C@]([H])(C[C@@]([H])(C1)n1c3ccccc3nc(C(O)=O)c1=O)N2C12CC3CC(C)(CC(C)(C3)C1)C2