Reaction Details
TargetFocal adhesion kinase 1
LigandBDBM10180
Substrate/Competitorn/a
Meas. Tech.Enzyme Assay
pH7.5±n/a
IC50 1±n/a nM
Commentsextracted
Citation Stadtmueller, HSapountzis, I Substituted pyrimidines for the treatment of diseases such as cancer US Patent US8846689 Publication Date 9/30/2014
 
Focal adhesion kinase 1
Name:Focal adhesion kinase 1
Type:Tyrosine-protein kinase
Mol. Mass.:119233.17
Organism:Homo sapiens (Human)
Description:Q05397
Residue:1052
BDBM10180
NameBDBM10180
Synonyms:US8846689, 156
Typen/a
Emp. Form.C29H30Cl2FN5O4
Mol. Mass.602.484
SMILESCOc1cc(C(=O)N[C@H]2CCN(C)C[C@H]2F)c(Cl)cc1Nc1ncc(Cl)c(Oc2cccc3C(C)C(C)C(=O)c23)n1