Reaction Details
TargetFocal adhesion kinase 1
LigandBDBM134110
Substrate/Competitorn/a
Meas. Tech.Enzyme Assay
pH7.5±n/a
IC50 1±n/a nM
Commentsextracted
Citation Stadtmueller, HSapountzis, I Substituted pyrimidines for the treatment of diseases such as cancer US Patent US8846689 Publication Date 9/30/2014
 
Focal adhesion kinase 1
Name:Focal adhesion kinase 1
Type:Tyrosine-protein kinase
Mol. Mass.:119233.17
Organism:Homo sapiens (Human)
Description:Q05397
Residue:1052
BDBM134110
NameBDBM134110
Synonyms:US8846689, 112
TypeSmall organic molecule
Emp. Form.C26H26N6O3
Mol. Mass.470.523
SMILESCOc1cc(ccc1Nc1ncc(C#N)c(Oc2cccc3CCC(=O)c23)n1)N1CCN(C)CC1