Reaction Details
TargetFocal adhesion kinase 1
LigandBDBM134116
Substrate/Competitorn/a
Meas. Tech.Enzyme Assay
pH7.5±n/a
IC50 1±n/a nM
Commentsextracted
Citation Stadtmueller, HSapountzis, I Substituted pyrimidines for the treatment of diseases such as cancer US Patent US8846689 Publication Date 9/30/2014
 
Focal adhesion kinase 1
Name:Focal adhesion kinase 1
Type:Tyrosine-protein kinase
Mol. Mass.:119233.17
Organism:Homo sapiens (Human)
Description:Q05397
Residue:1052
BDBM134116
NameBDBM134116
Synonyms:US8846689, 118
TypeSmall organic molecule
Emp. Form.C30H32F4N6O4
Mol. Mass.616.6065
SMILESCOc1cc(C(=O)NC2CCN(C)CC2)c(F)cc1Nc1ncc(c(Oc2cccc3c2C(=O)N(C)C3(C)C)n1)C(F)(F)F