Reaction Details
TargetFocal adhesion kinase 1
LigandBDBM134119
Substrate/Competitorn/a
Meas. Tech.Enzyme Assay
pH7.5±n/a
IC50 1±n/a nM
Commentsextracted
Citation Stadtmueller, HSapountzis, I Substituted pyrimidines for the treatment of diseases such as cancer US Patent US8846689 Publication Date 9/30/2014
 
Focal adhesion kinase 1
Name:Focal adhesion kinase 1
Type:Tyrosine-protein kinase
Mol. Mass.:119233.17
Organism:Homo sapiens (Human)
Description:Q05397
Residue:1052
BDBM134119
NameBDBM134119
Synonyms:US8846689, 121
TypeSmall organic molecule
Emp. Form.C31H34ClF3N6O5
Mol. Mass.663.087
SMILESCO[C@H]1CN(C)CC[C@H]1NC(=O)c1cc(OC)c(Nc2ncc(c(Oc3cccc4c3C(=O)N(C)C4(C)C)n2)C(F)(F)F)cc1Cl