Reaction Details
TargetFocal adhesion kinase 1
LigandBDBM134159
Substrate/Competitorn/a
Meas. Tech.Enzyme Assay
pH7.5±n/a
IC50 1±n/a nM
Commentsextracted
Citation Stadtmueller, HSapountzis, I Substituted pyrimidines for the treatment of diseases such as cancer US Patent US8846689 Publication Date 9/30/2014
 
Focal adhesion kinase 1
Name:Focal adhesion kinase 1
Type:Tyrosine-protein kinase
Mol. Mass.:119233.17
Organism:Homo sapiens (Human)
Description:Q05397
Residue:1052
BDBM134159
NameBDBM134159
Synonyms:US8846689, 161
TypeSmall organic molecule
Emp. Form.C29H32ClFN6O5
Mol. Mass.599.053
SMILESCO[C@H]1CN(C)CC[C@H]1NC(=O)c1cc(OC)c(Nc2ncc(Cl)c(Oc3cccc4[C@H](C)N(C)C(=O)c34)n2)cc1F