Reaction Details
TargetFocal adhesion kinase 1
LigandBDBM134160
Substrate/Competitorn/a
Meas. Tech.Enzyme Assay
pH7.5±n/a
IC50 1±n/a nM
Commentsextracted
Citation Stadtmueller, HSapountzis, I Substituted pyrimidines for the treatment of diseases such as cancer US Patent US8846689 Publication Date 9/30/2014
 
Focal adhesion kinase 1
Name:Focal adhesion kinase 1
Type:Tyrosine-protein kinase
Mol. Mass.:119233.17
Organism:Homo sapiens (Human)
Description:Q05397
Residue:1052
BDBM134160
NameBDBM134160
Synonyms:US8846689, 162
TypeSmall organic molecule
Emp. Form.C28H29ClF2N6O4
Mol. Mass.587.017
SMILESCOc1cc(C(=O)N[C@H]2CCN(C)C[C@H]2F)c(F)cc1Nc1ncc(Cl)c(Oc2cccc3[C@@H](C)N(C)C(=O)c23)n1