Reaction Details
TargetFocal adhesion kinase 1
LigandBDBM134162
Substrate/Competitorn/a
Meas. Tech.Enzyme Assay
pH7.5±n/a
IC50 1±n/a nM
Commentsextracted
Citation Stadtmueller, HSapountzis, I Substituted pyrimidines for the treatment of diseases such as cancer US Patent US8846689 Publication Date 9/30/2014
 
Focal adhesion kinase 1
Name:Focal adhesion kinase 1
Type:Tyrosine-protein kinase
Mol. Mass.:119233.17
Organism:Homo sapiens (Human)
Description:Q05397
Residue:1052
BDBM134162
NameBDBM134162
Synonyms:US8846689, 164
TypeSmall organic molecule
Emp. Form.C29H31ClF2N6O4
Mol. Mass.601.044
SMILESCCN1CC[C@H](NC(=O)c2cc(OC)c(Nc3ncc(Cl)c(Oc4cccc5[C@H](C)N(C)C(=O)c45)n3)cc2F)[C@H](F)C1