Reaction Details
TargetPurine nucleoside phosphorylase
LigandBDBM50293063
Substrate/Competitorn/a
Meas. Tech.Inhibition Assay
Temperature298.15±n/a K
Kd 0.469±n/a nM
Commentsextracted
Citation Clinch, KEvans, GBFurneaux, RHGulab, SAKelly, PMSchramm, VLTyler, PCWoolhouse, AD Acyclic amine inhibitors of nucleoside phosphorylases and hydrolases US Patent US8853224 Publication Date 10/7/2014
 
Purine nucleoside phosphorylase
Name:Purine nucleoside phosphorylase
Type:Enzyme
Mol. Mass.:32119.53
Organism:Homo sapiens (Human)
Description:n/a
Residue:289
BDBM50293063
NameBDBM50293063
Synonyms:7-{[(1,3-Dihydroxypropan-2-yl)(2-hydroxyethyl)amino]methyl}-3,5-dihydro-4H-pyrrolo[3,2-d]pyrimidin-4-one | CHEMBL508929
TypeSmall organic molecule
Emp. Form.C12H18N4O4
Mol. Mass.282.2957
SMILESOCCN(Cc1c[nH]c2c1nc[nH]c2=O)C(CO)CO