Reaction Details
TargetPurine nucleoside phosphorylase
LigandBDBM50293075
Substrate/Competitorn/a
Meas. Tech.Inhibition Assay
Temperature298.15±n/a K
Kd 14.1±n/a nM
Commentsextracted
Citation Clinch, KEvans, GBFurneaux, RHGulab, SAKelly, PMSchramm, VLTyler, PCWoolhouse, AD Acyclic amine inhibitors of nucleoside phosphorylases and hydrolases US Patent US8853224 Publication Date 10/7/2014
 
Purine nucleoside phosphorylase
Name:Purine nucleoside phosphorylase
Type:Enzyme
Mol. Mass.:32119.53
Organism:Homo sapiens (Human)
Description:n/a
Residue:289
BDBM50293075
NameBDBM50293075
Synonyms:7-({[3-Hydroxy-2-(hydroxymethyl)propyl]amino}methyl)-3,5-dihydro-4H-pyrrolo[3,2-d]pyrimidin-4-one | CHEMBL490081
TypeSmall organic molecule
Emp. Form.C11H16N4O3
Mol. Mass.252.2697
SMILESOCC(CO)CNCc1c[nH]c2c1nc[nH]c2=O