Reaction Details
TargetPurine nucleoside phosphorylase
LigandBDBM50293076
Substrate/Competitorn/a
Meas. Tech.Inhibition Assay
Temperature298.15±n/a K
Kd 14.9±n/a nM
Commentsextracted
Citation Clinch, KEvans, GBFurneaux, RHGulab, SAKelly, PMSchramm, VLTyler, PCWoolhouse, AD Acyclic amine inhibitors of nucleoside phosphorylases and hydrolases US Patent US8853224 Publication Date 10/7/2014
 
Purine nucleoside phosphorylase
Name:Purine nucleoside phosphorylase
Type:Enzyme
Mol. Mass.:32119.53
Organism:Homo sapiens (Human)
Description:n/a
Residue:289
BDBM50293076
NameBDBM50293076
Synonyms:7-({[(2R)-2,3-Dihydroxypropyl]amino}methyl)-3,5-dihydro-4Hpyrrolo[3,2-d]pyrimidin-4-one | CHEMBL524489
TypeSmall organic molecule
Emp. Form.C10H14N4O3
Mol. Mass.238.2432
SMILESOC[C@H](O)CNCc1c[nH]c2c1nc[nH]c2=O