Reaction Details
TargetPurine nucleoside phosphorylase
LigandBDBM136306
Substrate/Competitorn/a
Meas. Tech.Inhibition Assay
Temperature298.15±n/a K
Kd 15±n/a nM
Commentsextracted
Citation Clinch, KEvans, GBFurneaux, RHGulab, SAKelly, PMSchramm, VLTyler, PCWoolhouse, AD Acyclic amine inhibitors of nucleoside phosphorylases and hydrolases US Patent US8853224 Publication Date 10/7/2014
 
Purine nucleoside phosphorylase
Name:Purine nucleoside phosphorylase
Type:Enzyme
Mol. Mass.:32119.53
Organism:Homo sapiens (Human)
Description:n/a
Residue:289
BDBM136306
NameBDBM136306
Synonyms:US8853224, 24
TypeSmall organic molecule
Emp. Form.C12H18N4O3S
Mol. Mass.298.361
SMILESCSC[C@H](NCc1c[nH]c2c1nc[nH]c2=O)[C@H](O)CO