Reaction Details
TargetPurine nucleoside phosphorylase
LigandBDBM136310
Substrate/Competitorn/a
Meas. Tech.Inhibition Assay
Temperature298.15±n/a K
Kd 5.6±n/a nM
Commentsextracted
Citation Clinch, KEvans, GBFurneaux, RHGulab, SAKelly, PMSchramm, VLTyler, PCWoolhouse, AD Acyclic amine inhibitors of nucleoside phosphorylases and hydrolases US Patent US8853224 Publication Date 10/7/2014
 
Purine nucleoside phosphorylase
Name:Purine nucleoside phosphorylase
Type:Enzyme
Mol. Mass.:32119.53
Organism:Homo sapiens (Human)
Description:n/a
Residue:289
BDBM136310
NameBDBM136310
Synonyms:US8853224, 28
TypeSmall organic molecule
Emp. Form.C13H20N4O3S
Mol. Mass.312.388
SMILESCSCC(CNCc1c[nH]c2c1nc[nH]c2=O)[C@H](O)CO