Reaction Details
TargetPurine nucleoside phosphorylase
LigandBDBM50293068
Substrate/Competitorn/a
Meas. Tech.Inhibition Assay
Temperature298.15±n/a K
Kd 430±n/a nM
Commentsextracted
Citation Clinch, KEvans, GBFurneaux, RHGulab, SAKelly, PMSchramm, VLTyler, PCWoolhouse, AD Acyclic amine inhibitors of nucleoside phosphorylases and hydrolases US Patent US8853224 Publication Date 10/7/2014
 
Purine nucleoside phosphorylase
Name:Purine nucleoside phosphorylase
Type:Enzyme
Mol. Mass.:26857.85
Organism:Plasmodium falciparum
Description:n/a
Residue:245
BDBM50293068
NameBDBM50293068
Synonyms:7-{[(2-Hydroxyethyl)amino]methyl}-3,5-dihydro-4H-pyrrolo[3,2-d]pyrimidin-4-one | CHEMBL490284
TypeSmall organic molecule
Emp. Form.C9H12N4O2
Mol. Mass.208.2172
SMILESOCCNCc1c[nH]c2c1nc[nH]c2=O