Reaction Details
TargetPurine nucleoside phosphorylase
LigandBDBM136303
Substrate/Competitorn/a
Meas. Tech.Inhibition Assay
Temperature298.15±n/a K
Kd 2000±n/a nM
Commentsextracted
Citation Clinch, KEvans, GBFurneaux, RHGulab, SAKelly, PMSchramm, VLTyler, PCWoolhouse, AD Acyclic amine inhibitors of nucleoside phosphorylases and hydrolases US Patent US8853224 Publication Date 10/7/2014
 
Purine nucleoside phosphorylase
Name:Purine nucleoside phosphorylase
Type:Enzyme
Mol. Mass.:26857.85
Organism:Plasmodium falciparum
Description:n/a
Residue:245
BDBM136303
NameBDBM136303
Synonyms:US8853224, 3.4
TypeSmall organic molecule
Emp. Form.C17H20N4O3
Mol. Mass.328.3657
SMILESOC[C@H](O)CN(Cc1c[nH]c2c1nc[nH]c2=O)Cc1ccccc1