Reaction Details
TargetPurine nucleoside phosphorylase
LigandBDBM50293083
Substrate/Competitorn/a
Meas. Tech.Inhibition Assay
Temperature298.15±n/a K
Kd 770±n/a nM
Commentsextracted
Citation Clinch, KEvans, GBFurneaux, RHGulab, SAKelly, PMSchramm, VLTyler, PCWoolhouse, AD Acyclic amine inhibitors of nucleoside phosphorylases and hydrolases US Patent US8853224 Publication Date 10/7/2014
 
Purine nucleoside phosphorylase
Name:Purine nucleoside phosphorylase
Type:Enzyme
Mol. Mass.:26857.85
Organism:Plasmodium falciparum
Description:n/a
Residue:245
BDBM50293083
NameBDBM50293083
Synonyms:7-({[(2R/S)-2,4-Dihydroxybutyl](methyl)amino}methyl)-3,5-dihydro-4H-pyrrolo[3,2-d]pyrimidin-4-one | CHEMBL453099
TypeSmall organic molecule
Emp. Form.C12H18N4O3
Mol. Mass.266.2963
SMILESCN(CC(O)CCO)Cc1c[nH]c2c1nc[nH]c2=O