Reaction Details
TargetPurine nucleoside phosphorylase
LigandBDBM136312
Substrate/Competitorn/a
Meas. Tech.Inhibition Assay
Temperature298.15±n/a K
Kd 1100±n/a nM
Commentsextracted
Citation Clinch, KEvans, GBFurneaux, RHGulab, SAKelly, PMSchramm, VLTyler, PCWoolhouse, AD Acyclic amine inhibitors of nucleoside phosphorylases and hydrolases US Patent US8853224 Publication Date 10/7/2014
 
Purine nucleoside phosphorylase
Name:Purine nucleoside phosphorylase
Type:Enzyme
Mol. Mass.:26857.85
Organism:Plasmodium falciparum
Description:n/a
Residue:245
BDBM136312
NameBDBM136312
Synonyms:US8853224, 29
TypeSmall organic molecule
Emp. Form.C20H26N4O3S
Mol. Mass.402.51
SMILESCSCC(CN(Cc1c[nH]c2c1nc[nH]c2=O)Cc1ccccc1)[C@H](O)CO